BDBM425833 US10519177, Compound P-1033::methyl 4-[6-(3,5-dimethylisoxazol- 4-yl)-1H-pyrrolo[3,2-b]pyridin-3- yl]benzoate
SMILES COC(=O)c1ccc(cc1)-c1c[nH]c2cc(cnc12)-c1c(C)noc1C
InChI Key InChIKey=QIUKGCCZNDBHFO-UHFFFAOYSA-N
Data  1 IC50
  Tab Delimited (TSV)   2D SDfile   Computed 3D by Vconf -m prep SDfile
Find this compound or compounds like it in BindingDB:
Activity Spreadsheet -- Enzyme Inhibition Constant Data from BindingDB
Found 1 hit for monomerid = 425833
TargetBromodomain-containing protein 4 [1-477](Homo sapiens (Human))
Plexxikon
US Patent
LigandPNGBDBM425833(US10519177, Compound P-1033 | methyl 4-[6-(3,5-dim...)
Affinity DataIC50: <1.00E+3nM
Ligand InfoPC cidPC sid
In DepthDetails US Patent