BDBM427299 (S)-methyl (4-(4-((2-amino-2,4-dimethylpentyl)oxy)-3-chlorophenyl)pyrimidin-2-yl)carbamate::US10544120, Example 307
SMILES COC(=O)Nc1nccc(n1)-c1ccc(OC[C@](C)(CC(C)C)NC(=O)OC(C)(C)C)c(Cl)c1
InChI Key InChIKey=AMFMYUMFPDUDSR-DEOSSOPVSA-N
Data  1 IC50
  Tab Delimited (TSV)   2D SDfile   Computed 3D by Vconf -m prep SDfile
Find this compound or compounds like it in BindingDB:
Activity Spreadsheet -- Enzyme Inhibition Constant Data from BindingDB
Found 1 hit for monomerid = 427299
TargetAP2-associated protein kinase 1(Homo sapiens (Human))
Bristol-Myers Squibb
US Patent
LigandPNGBDBM427299((S)-methyl (4-(4-((2-amino-2,4-dimethylpentyl)oxy)...)
Affinity DataIC50:  0.900nM. Assay description: The assays were performed in U-bottom 384-well plates. The final assay volume was 30 μl prepared from 15 μl additions of enzyme and substra...
Ligand InfoPC cidPC sid
In DepthDetails US Patent