BDBM427338 (S)-methyl (4-(6-((2-amino-2,4-dimethylpentyl)oxy)-4-methylpyridin-3-yl)pyrimidin-2-yl)carbamate::US10544120, Example 374
SMILES COC(=O)Nc1nccc(n1)-c1cnc(OC[C@@](C)(N)CC(C)C)cc1C
InChI Key InChIKey=RATCBMQFWBQWKS-IBGZPJMESA-N
Data  1 IC50
  Tab Delimited (TSV)   2D SDfile   Computed 3D by Vconf -m prep SDfile
Find this compound or compounds like it in BindingDB:
Activity Spreadsheet -- Enzyme Inhibition Constant Data from BindingDB
Found 1 hit for monomerid = 427338
TargetAP2-associated protein kinase 1(Homo sapiens (Human))
Bristol-Myers Squibb
US Patent
LigandPNGBDBM427338((S)-methyl (4-(6-((2-amino-2,4-dimethylpentyl)oxy)...)
Affinity DataIC50:  339nM. Assay description: The assays were performed in U-bottom 384-well plates. The final assay volume was 30 μl prepared from 15 μl additions of enzyme and substra...
Ligand InfoPC cidPC sid
In DepthDetails US Patent