BDBM427564 6-(3-isopropyl-5-(piperazin-1-yl)-1H-pyrrolo[3,2-b]pyridin-2-yl)-7,8-dimethyl-[1,2,4]triazolo[1,5-a]pyridine::US10544143, Example 2::US10544143, Example 857::US10730877, Example 857::US11053244, Example 857
SMILES CC(C)c1c([nH]c2ccc(nc12)N1CCNCC1)-c1cn2ncnc2c(C)c1C
InChI Key InChIKey=XLLPHYRQYQABDZ-UHFFFAOYSA-N
Data  18 IC50
  Tab Delimited (TSV)   2D SDfile   Computed 3D by Vconf -m prep SDfile
Find this compound or compounds like it in BindingDB:
Activity Spreadsheet -- Enzyme Inhibition Constant Data from BindingDB
Found 18 hits for monomerid = 427564
TargetToll-like receptor 7(Homo sapiens (Human))
Bristol-Myers Squibb
US Patent
LigandPNGBDBM427564(6-(3-isopropyl-5-(piperazin-1-yl)-1H-pyrrolo[3,2-b...)
Affinity DataIC50:  0.650nM. Assay description: HEK-Blue-cells (Invivogen) overexpressing human TLR7, TLR8 or TLR9 receptors were used for screening inhibitors of these receptors using an inducible...
Ligand InfoPC cidPC sid
In DepthDetails US Patent
TargetToll-like receptor 9(Homo sapiens (Human))
Bristol-Myers Squibb
US Patent
LigandPNGBDBM427564(6-(3-isopropyl-5-(piperazin-1-yl)-1H-pyrrolo[3,2-b...)
Affinity DataIC50:  7.33E+3nM. Assay description: HEK-Blue™-cells (Invivogen) overexpressing human TLR7, TLR8 or TLR9 receptors were used for screening inhibitors of these receptors using an inducibl...
Ligand InfoPC cidPC sid
In DepthDetails US Patent
TargetToll-like receptor 9(Homo sapiens (Human))
Bristol-Myers Squibb
US Patent
LigandPNGBDBM427564(6-(3-isopropyl-5-(piperazin-1-yl)-1H-pyrrolo[3,2-b...)
Affinity DataIC50:  4.40E+3nM. Assay description: HEK-Blue-cells (Invivogen) overexpressing human TLR7, TLR8 or TLR9 receptors were used for screening inhibitors of these receptors using an inducible...
Ligand InfoPC cidPC sid
In DepthDetails US Patent
TargetToll-like receptor 7(Homo sapiens (Human))
Bristol-Myers Squibb
US Patent
LigandPNGBDBM427564(6-(3-isopropyl-5-(piperazin-1-yl)-1H-pyrrolo[3,2-b...)
Affinity DataIC50:  1.70nM. Assay description: HEK-Blue-cells (Invivogen) overexpressing human TLR7, TLR8 or TLR9 receptors were used for screening inhibitors of these receptors using an inducible...
Ligand InfoPC cidPC sid
In DepthDetails US Patent
TargetToll-like receptor 8(Homo sapiens (Human))
Bristol-Myers Squibb
US Patent
LigandPNGBDBM427564(6-(3-isopropyl-5-(piperazin-1-yl)-1H-pyrrolo[3,2-b...)
Affinity DataIC50:  0.270nM. Assay description: HEK-Blue-cells (Invivogen) overexpressing human TLR7, TLR8 or TLR9 receptors were used for screening inhibitors of these receptors using an inducible...
Ligand InfoPC cidPC sid
In DepthDetails US Patent
TargetToll-like receptor 9(Homo sapiens (Human))
Bristol-Myers Squibb
US Patent
LigandPNGBDBM427564(6-(3-isopropyl-5-(piperazin-1-yl)-1H-pyrrolo[3,2-b...)
Affinity DataIC50:  7.33E+3nM. Assay description: HEK-Blue-cells (Invivogen) overexpressing human TLR7, TLR8 or TLR9 receptors were used for screening inhibitors of these receptors using an inducible...
Ligand InfoPC cidPC sid
In DepthDetails US Patent
TargetToll-like receptor 7(Homo sapiens (Human))
Bristol-Myers Squibb
US Patent
LigandPNGBDBM427564(6-(3-isopropyl-5-(piperazin-1-yl)-1H-pyrrolo[3,2-b...)
Affinity DataIC50:  0.650nM. Assay description: HEK-Blue-cells (Invivogen) overexpressing human TLR7, TLR8 or TLR9 receptors were used for screening inhibitors of these receptors using an inducible...
Ligand InfoPC cidPC sid
In DepthDetails US Patent
TargetToll-like receptor 8(Homo sapiens (Human))
Bristol-Myers Squibb
US Patent
LigandPNGBDBM427564(6-(3-isopropyl-5-(piperazin-1-yl)-1H-pyrrolo[3,2-b...)
Affinity DataIC50:  0.400nM. Assay description: HEK-Blue-cells (Invivogen) overexpressing human TLR7, TLR8 or TLR9 receptors were used for screening inhibitors of these receptors using an inducible...
Ligand InfoPC cidPC sid
In DepthDetails US Patent
TargetToll-like receptor 9(Homo sapiens (Human))
Bristol-Myers Squibb
US Patent
LigandPNGBDBM427564(6-(3-isopropyl-5-(piperazin-1-yl)-1H-pyrrolo[3,2-b...)
Affinity DataIC50:  4.40E+3nM. Assay description: HEK-Blue-cells (Invivogen) overexpressing human TLR7, TLR8 or TLR9 receptors were used for screening inhibitors of these receptors using an inducible...
Ligand InfoPC cidPC sid
In DepthDetails US Patent
TargetToll-like receptor 7(Homo sapiens (Human))
Bristol-Myers Squibb
US Patent
LigandPNGBDBM427564(6-(3-isopropyl-5-(piperazin-1-yl)-1H-pyrrolo[3,2-b...)
Affinity DataIC50:  1.70nM. Assay description: HEK-Blue-cells (Invivogen) overexpressing human TLR7, TLR8 or TLR9 receptors were used for screening inhibitors of these receptors using an inducible...
Ligand InfoPC cidPC sid
In DepthDetails US Patent
TargetToll-like receptor 8(Homo sapiens (Human))
Bristol-Myers Squibb
US Patent
LigandPNGBDBM427564(6-(3-isopropyl-5-(piperazin-1-yl)-1H-pyrrolo[3,2-b...)
Affinity DataIC50:  0.270nM. Assay description: HEK-Blue-cells (Invivogen) overexpressing human TLR7, TLR8 or TLR9 receptors were used for screening inhibitors of these receptors using an inducible...
Ligand InfoPC cidPC sid
In DepthDetails US Patent
TargetToll-like receptor 9(Homo sapiens (Human))
Bristol-Myers Squibb
US Patent
LigandPNGBDBM427564(6-(3-isopropyl-5-(piperazin-1-yl)-1H-pyrrolo[3,2-b...)
Affinity DataIC50:  7.33E+3nM. Assay description: HEK-Blue-cells (Invivogen) overexpressing human TLR7, TLR8 or TLR9 receptors were used for screening inhibitors of these receptors using an inducible...
Ligand InfoPC cidPC sid
In DepthDetails US Patent
TargetToll-like receptor 7(Homo sapiens (Human))
Bristol-Myers Squibb
US Patent
LigandPNGBDBM427564(6-(3-isopropyl-5-(piperazin-1-yl)-1H-pyrrolo[3,2-b...)
Affinity DataIC50:  0.650nM. Assay description: HEK-Blue™-cells (Invivogen) overexpressing human TLR7, TLR8 or TLR9 receptors were used for screening inhibitors of these receptors using an inducibl...
Ligand InfoPC cidPC sid
In DepthDetails US Patent
TargetToll-like receptor 8(Homo sapiens (Human))
Bristol-Myers Squibb
US Patent
LigandPNGBDBM427564(6-(3-isopropyl-5-(piperazin-1-yl)-1H-pyrrolo[3,2-b...)
Affinity DataIC50:  0.400nM. Assay description: HEK-Blue™-cells (Invivogen) overexpressing human TLR7, TLR8 or TLR9 receptors were used for screening inhibitors of these receptors using an inducibl...
Ligand InfoPC cidPC sid
In DepthDetails US Patent
TargetToll-like receptor 9(Homo sapiens (Human))
Bristol-Myers Squibb
US Patent
LigandPNGBDBM427564(6-(3-isopropyl-5-(piperazin-1-yl)-1H-pyrrolo[3,2-b...)
Affinity DataIC50:  4.40E+3nM. Assay description: HEK-Blue™-cells (Invivogen) overexpressing human TLR7, TLR8 or TLR9 receptors were used for screening inhibitors of these receptors using an inducibl...
Ligand InfoPC cidPC sid
In DepthDetails US Patent
TargetToll-like receptor 7(Homo sapiens (Human))
Bristol-Myers Squibb
US Patent
LigandPNGBDBM427564(6-(3-isopropyl-5-(piperazin-1-yl)-1H-pyrrolo[3,2-b...)
Affinity DataIC50:  1.70nM. Assay description: HEK-Blue™-cells (Invivogen) overexpressing human TLR7, TLR8 or TLR9 receptors were used for screening inhibitors of these receptors using an inducibl...
Ligand InfoPC cidPC sid
In DepthDetails US Patent
TargetToll-like receptor 8(Homo sapiens (Human))
Bristol-Myers Squibb
US Patent
LigandPNGBDBM427564(6-(3-isopropyl-5-(piperazin-1-yl)-1H-pyrrolo[3,2-b...)
Affinity DataIC50:  0.270nM. Assay description: HEK-Blue™-cells (Invivogen) overexpressing human TLR7, TLR8 or TLR9 receptors were used for screening inhibitors of these receptors using an inducibl...
Ligand InfoPC cidPC sid
In DepthDetails US Patent
TargetToll-like receptor 8(Homo sapiens (Human))
Bristol-Myers Squibb
US Patent
LigandPNGBDBM427564(6-(3-isopropyl-5-(piperazin-1-yl)-1H-pyrrolo[3,2-b...)
Affinity DataIC50:  0.400nM. Assay description: HEK-Blue-cells (Invivogen) overexpressing human TLR7, TLR8 or TLR9 receptors were used for screening inhibitors of these receptors using an inducible...
Ligand InfoPC cidPC sid
In DepthDetails US Patent