BDBM428148 US10544143, Example 584::US10730877, Example 584::US11053244, Example 584
SMILES COc1cc(cn2ncnc12)-c1[nH]c2cc(C)c(nc2c1C(C)C)C1CCN(CC(=O)N(C)C)CC1
InChI Key InChIKey=MLUQABGTAXMAHN-UHFFFAOYSA-N
Data  9 IC50
  Tab Delimited (TSV)   2D SDfile   Computed 3D by Vconf -m prep SDfile
Find this compound or compounds like it in BindingDB:
Activity Spreadsheet -- Enzyme Inhibition Constant Data from BindingDB
Found 9 hits for monomerid = 428148
TargetToll-like receptor 7(Homo sapiens (Human))
Bristol-Myers Squibb
US Patent
LigandPNGBDBM428148(US10544143, Example 584 | US10730877, Example 584 ...)
Affinity DataIC50:  0.240nM. Assay description: HEK-Blue-cells (Invivogen) overexpressing human TLR7, TLR8 or TLR9 receptors were used for screening inhibitors of these receptors using an inducible...
Ligand InfoPC cidPC sid
In DepthDetails US Patent
TargetToll-like receptor 8(Homo sapiens (Human))
Bristol-Myers Squibb
US Patent
LigandPNGBDBM428148(US10544143, Example 584 | US10730877, Example 584 ...)
Affinity DataIC50:  29nM. Assay description: HEK-Blue-cells (Invivogen) overexpressing human TLR7, TLR8 or TLR9 receptors were used for screening inhibitors of these receptors using an inducible...
Ligand InfoPC cidPC sid
In DepthDetails US Patent
TargetToll-like receptor 9(Homo sapiens (Human))
Bristol-Myers Squibb
US Patent
LigandPNGBDBM428148(US10544143, Example 584 | US10730877, Example 584 ...)
Affinity DataIC50:  2.01E+3nM. Assay description: HEK-Blue-cells (Invivogen) overexpressing human TLR7, TLR8 or TLR9 receptors were used for screening inhibitors of these receptors using an inducible...
Ligand InfoPC cidPC sid
In DepthDetails US Patent
TargetToll-like receptor 7(Homo sapiens (Human))
Bristol-Myers Squibb
US Patent
LigandPNGBDBM428148(US10544143, Example 584 | US10730877, Example 584 ...)
Affinity DataIC50:  0.240nM. Assay description: HEK-Blue-cells (Invivogen) overexpressing human TLR7, TLR8 or TLR9 receptors were used for screening inhibitors of these receptors using an inducible...
Ligand InfoPC cidPC sid
In DepthDetails US Patent
TargetToll-like receptor 9(Homo sapiens (Human))
Bristol-Myers Squibb
US Patent
LigandPNGBDBM428148(US10544143, Example 584 | US10730877, Example 584 ...)
Affinity DataIC50:  2.01E+3nM. Assay description: HEK-Blue™-cells (Invivogen) overexpressing human TLR7, TLR8 or TLR9 receptors were used for screening inhibitors of these receptors using an inducibl...
Ligand InfoPC cidPC sid
In DepthDetails US Patent
TargetToll-like receptor 9(Homo sapiens (Human))
Bristol-Myers Squibb
US Patent
LigandPNGBDBM428148(US10544143, Example 584 | US10730877, Example 584 ...)
Affinity DataIC50:  2.01E+3nM. Assay description: HEK-Blue-cells (Invivogen) overexpressing human TLR7, TLR8 or TLR9 receptors were used for screening inhibitors of these receptors using an inducible...
Ligand InfoPC cidPC sid
In DepthDetails US Patent
TargetToll-like receptor 7(Homo sapiens (Human))
Bristol-Myers Squibb
US Patent
LigandPNGBDBM428148(US10544143, Example 584 | US10730877, Example 584 ...)
Affinity DataIC50:  0.240nM. Assay description: HEK-Blue™-cells (Invivogen) overexpressing human TLR7, TLR8 or TLR9 receptors were used for screening inhibitors of these receptors using an inducibl...
Ligand InfoPC cidPC sid
In DepthDetails US Patent
TargetToll-like receptor 8(Homo sapiens (Human))
Bristol-Myers Squibb
US Patent
LigandPNGBDBM428148(US10544143, Example 584 | US10730877, Example 584 ...)
Affinity DataIC50:  29nM. Assay description: HEK-Blue™-cells (Invivogen) overexpressing human TLR7, TLR8 or TLR9 receptors were used for screening inhibitors of these receptors using an inducibl...
Ligand InfoPC cidPC sid
In DepthDetails US Patent
TargetToll-like receptor 8(Homo sapiens (Human))
Bristol-Myers Squibb
US Patent
LigandPNGBDBM428148(US10544143, Example 584 | US10730877, Example 584 ...)
Affinity DataIC50:  29nM. Assay description: HEK-Blue-cells (Invivogen) overexpressing human TLR7, TLR8 or TLR9 receptors were used for screening inhibitors of these receptors using an inducible...
Ligand InfoPC cidPC sid
In DepthDetails US Patent