BDBM428859 US10532048, Example 712
SMILES CS(=O)(=O)N[C@H]1CCCC[C@@H]1N1[C@H]([C@H](C(=O)NOCc2ccc(cc2)C(F)(F)C(O)=O)c2ccccc2C1=O)c1ccc(Cl)cc1Cl
InChI Key InChIKey=HONDSZAZVZGXAL-BPXGVECKSA-N
Data  1 IC50
  Tab Delimited (TSV)   2D SDfile   Computed 3D by Vconf -m prep SDfile
Find this compound or compounds like it in BindingDB:
Activity Spreadsheet -- Enzyme Inhibition Constant Data from BindingDB
Found 1 hit for monomerid = 428859
TargetBombesin receptor subtype-3(Homo sapiens (Human))
Seldar Pharma
US Patent
LigandPNGBDBM428859(US10532048, Example 712)
Affinity DataIC50:  6.70nM. Assay description: A BB2 receptor binding test was carried out using a membrane sample prepared from a human prostate cancer-derived PC-3 cell. The PC-3 cell was cultur...
Ligand InfoPC cidPC sid
In DepthDetails US Patent