BDBM42933 MLS000090203::SMR000024814::bis[[mesyl(methyl)amino]methyl]phosphinic acid::bis[[methyl(methylsulfonyl)amino]methyl]phosphinic acid::bis{[methyl(methylsulfonyl)amino]methyl}phosphinic acid::cid_3240635
SMILES CN(CP(O)(=O)CN(C)S(C)(=O)=O)S(C)(=O)=O
InChI Key InChIKey=DCIRVAHWZHBIRX-UHFFFAOYSA-N
Data  3 EC50
  Tab Delimited (TSV)   2D SDfile   Computed 3D by Vconf -m prep SDfile
Find this compound or compounds like it in BindingDB:
Activity Spreadsheet -- Enzyme Inhibition Constant Data from BindingDB
Found 3 hits for monomerid = 42933
TargetNuclear receptor coactivator 3(Homo sapiens (Human))
The Scripps Research Institute Molecular Screening Center
Curated by PubChem BioAssay
LigandPNGBDBM42933(MLS000090203 | SMR000024814 | bis[[mesyl(methyl)am...)
Affinity DataEC50: >7.94E+4nM. Assay description: Source (MLSCN Center Name): The Scripps Research Institute Molecular Screening Center http://molscreen.florida.scripps.edu/ Center Affiliation: The ...
In DepthDetails PCBioAssay
TargetNuclear receptor coactivator 1(Homo sapiens (Human))
The Scripps Research Institute Molecular Screening Center
Curated by PubChem BioAssay
LigandPNGBDBM42933(MLS000090203 | SMR000024814 | bis[[mesyl(methyl)am...)
Affinity DataEC50: >7.94E+4nM. Assay description: Source (MLSCN Center Name): The Scripps Research Institute Molecular Screening Center Center Affiliation: The Scripps Research Institute (TSRI) Assay...
In DepthDetails PCBioAssay
TargetNuclear receptor coactivator 2(Homo sapiens (Human))
The Scripps Research Institute Molecular Screening Center
Curated by PubChem BioAssay
LigandPNGBDBM42933(MLS000090203 | SMR000024814 | bis[[mesyl(methyl)am...)
Affinity DataEC50: >7.94E+4nM. Assay description: Source (MLSCN Center Name): The Scripps Research Institute Molecular Screening Center Center Affiliation: The Scripps Research Institute (TSRI) Assay...
In DepthDetails PCBioAssay