BDBM429599 US10550091, No. LC-8::US10947203, No. LC-8
SMILES COc1cc(c(OC)cc1F)-n1nnc(c1C)S(=O)(=O)c1ccc(cc1)C(C)(C)C
InChI Key InChIKey=FADZTFWMZOQMAW-UHFFFAOYSA-N
Data  6 IC50  1 EC50
  Tab Delimited (TSV)   2D SDfile   Computed 3D by Vconf -m prep SDfile
Find this compound or compounds like it in BindingDB:
Activity Spreadsheet -- Enzyme Inhibition Constant Data from BindingDB
Found 7 hits for monomerid = 429599
TargetNuclear receptor subfamily 1 group I member 2(Homo sapiens (Human))
St. Jude Children''S Research Hospital
US Patent
LigandPNGBDBM429599(US10550091, No. LC-8 | US10947203, No. LC-8)
Affinity DataIC50:  10nM. Assay description: The time-resolved fluorescence resonance transfer (TR-FRET) hPXR competitive binding assay was performed according to the manufacturer's instruct...
Ligand InfoPC cidPC sid
In DepthDetails US Patent
TargetNuclear receptor subfamily 1 group I member 2(Homo sapiens (Human))
St. Jude Children''S Research Hospital
US Patent
LigandPNGBDBM429599(US10550091, No. LC-8 | US10947203, No. LC-8)
Affinity DataIC50:  1.52E+3nM. Assay description: The hPXR transactivation assays (PXR agonistic and antagonistic assays) were performed in the HepG2 cells stably expressing FLAG-hPXR and CYP3A4-luci...
Ligand InfoPC cidPC sid
In DepthDetails US Patent
TargetNuclear receptor subfamily 1 group I member 2(Homo sapiens (Human))
St. Jude Children''S Research Hospital
US Patent
LigandPNGBDBM429599(US10550091, No. LC-8 | US10947203, No. LC-8)
Affinity DataIC50:  10nM. Assay description: The time-resolved fluorescence resonance transfer (TR-FRET) hPXR competitive binding assay was performed according to the manufacturer's instruct...
Ligand InfoPC cidPC sid
In DepthDetails US Patent
TargetNuclear receptor subfamily 1 group I member 2(Homo sapiens (Human))
St. Jude Children''S Research Hospital
US Patent
LigandPNGBDBM429599(US10550091, No. LC-8 | US10947203, No. LC-8)
Affinity DataIC50:  2.00E+3nM. Assay description: Antagonist activity at human PXR expressed in HepG2 cells co-expressing luciferase gene under control of CYP3A4 promoter incubated for 24 hrs in pres...
Ligand InfoPC cidPC sid
In DepthDetails ArticlePubMed
TargetNuclear receptor subfamily 1 group I member 2(Homo sapiens (Human))
St. Jude Children''S Research Hospital
US Patent
LigandPNGBDBM429599(US10550091, No. LC-8 | US10947203, No. LC-8)
Affinity DataIC50:  4.00E+3nM. Assay description: Displacement of BODIPY FL vindoline from GST-tagged human PXR LBD incubated for 60 mins by TR-FRET assay
Ligand InfoPC cidPC sid
In DepthDetails ArticlePubMed
TargetNuclear receptor subfamily 1 group I member 2(Homo sapiens (Human))
St. Jude Children''S Research Hospital
US Patent
LigandPNGBDBM429599(US10550091, No. LC-8 | US10947203, No. LC-8)
Affinity DataEC50:  1.00E+3nM. Assay description: Agonist activity at human PXR expressed in HepG2 cells co-expressing luciferase gene under control of CYP3A4 promoter incubated for 24 hrs by lucifer...
Ligand InfoPC cidPC sid
In DepthDetails ArticlePubMed
TargetNuclear receptor subfamily 1 group I member 2(Homo sapiens (Human))
St. Jude Children''S Research Hospital
US Patent
LigandPNGBDBM429599(US10550091, No. LC-8 | US10947203, No. LC-8)
Affinity DataIC50:  1.52E+3nM. Assay description: The hPXR transactivation assays (PXR agonistic and antagonistic assays) were performed in the HepG2 cells stably expressing FLAG-hPXR and CYP3A4-luci...
Ligand InfoPC cidPC sid
In DepthDetails US Patent