BDBM429626 US10550091, No. LC-35::US10947203, No. LC-35
SMILES COc1cc(C(C)=O)c(Cl)cc1-n1nnc(c1C)S(=O)(=O)c1ccc(cc1)C(C)(C)C
InChI Key InChIKey=IATNWTNALCFDJK-UHFFFAOYSA-N
Data  2 IC50  3 EC50
  Tab Delimited (TSV)   2D SDfile   Computed 3D by Vconf -m prep SDfile
Find this compound or compounds like it in BindingDB:
Activity Spreadsheet -- Enzyme Inhibition Constant Data from BindingDB
Found 5 hits for monomerid = 429626
TargetNuclear receptor subfamily 1 group I member 2(Homo sapiens (Human))
St. Jude Children''S Research Hospital
US Patent
LigandPNGBDBM429626(US10550091, No. LC-35 | US10947203, No. LC-35)
Affinity DataIC50:  10nM. Assay description: The time-resolved fluorescence resonance transfer (TR-FRET) hPXR competitive binding assay was performed according to the manufacturer's instruct...
Ligand InfoPC cidPC sid
In DepthDetails US Patent
TargetNuclear receptor subfamily 1 group I member 2(Homo sapiens (Human))
St. Jude Children''S Research Hospital
US Patent
LigandPNGBDBM429626(US10550091, No. LC-35 | US10947203, No. LC-35)
Affinity DataEC50:  1.30E+3nM. Assay description: The hPXR transactivation assays (PXR agonistic and antagonistic assays) were performed in the HepG2 cells stably expressing FLAG-hPXR and CYP3A4-luci...
Ligand InfoPC cidPC sid
In DepthDetails US Patent
TargetNuclear receptor subfamily 1 group I member 2(Homo sapiens (Human))
St. Jude Children''S Research Hospital
US Patent
LigandPNGBDBM429626(US10550091, No. LC-35 | US10947203, No. LC-35)
Affinity DataEC50:  260nM. Assay description: Agonist activity at human PXR expressed in HepG2 cells co-expressing luciferase gene under control of CYP3A4 promoter incubated for 24 hrs by lucifer...
Ligand InfoPC cidPC sid
In DepthDetails ArticlePubMed
TargetNuclear receptor subfamily 1 group I member 2(Homo sapiens (Human))
St. Jude Children''S Research Hospital
US Patent
LigandPNGBDBM429626(US10550091, No. LC-35 | US10947203, No. LC-35)
Affinity DataEC50:  1.30E+3nM. Assay description: The hPXR transactivation assays (PXR agonistic and antagonistic assays) were performed in the HepG2 cells stably expressing FLAG-hPXR and CYP3A4-luci...
Ligand InfoPC cidPC sid
In DepthDetails US Patent
TargetNuclear receptor subfamily 1 group I member 2(Homo sapiens (Human))
St. Jude Children''S Research Hospital
US Patent
LigandPNGBDBM429626(US10550091, No. LC-35 | US10947203, No. LC-35)
Affinity DataIC50:  10nM. Assay description: The time-resolved fluorescence resonance transfer (TR-FRET) hPXR competitive binding assay was performed according to the manufacturer's instruct...
Ligand InfoPC cidPC sid
In DepthDetails US Patent