BDBM429675 US10550091, No. LC-84::US10947203, No. LC-84
SMILES COc1ccc(OC)c(c1)-n1nnc(c1C)S(=O)(=O)c1ccc(cc1O)C(C)(C)C
InChI Key InChIKey=UUXQDYAKWYLMJP-UHFFFAOYSA-N
Data  2 IC50  2 EC50
  Tab Delimited (TSV)   2D SDfile   Computed 3D by Vconf -m prep SDfile
Find this compound or compounds like it in BindingDB:
Activity Spreadsheet -- Enzyme Inhibition Constant Data from BindingDB
Found 4 hits for monomerid = 429675
TargetNuclear receptor subfamily 1 group I member 2(Homo sapiens (Human))
St. Jude Children''S Research Hospital
US Patent
LigandPNGBDBM429675(US10550091, No. LC-84 | US10947203, No. LC-84)
Affinity DataIC50:  30nM. Assay description: The time-resolved fluorescence resonance transfer (TR-FRET) hPXR competitive binding assay was performed according to the manufacturer's instruct...
Ligand InfoPC cidPC sid
In DepthDetails US Patent
TargetNuclear receptor subfamily 1 group I member 2(Homo sapiens (Human))
St. Jude Children''S Research Hospital
US Patent
LigandPNGBDBM429675(US10550091, No. LC-84 | US10947203, No. LC-84)
Affinity DataEC50:  3.30E+3nM. Assay description: The hPXR transactivation assays (PXR agonistic and antagonistic assays) were performed in the HepG2 cells stably expressing FLAG-hPXR and CYP3A4-luci...
Ligand InfoPC cidPC sid
In DepthDetails US Patent
TargetNuclear receptor subfamily 1 group I member 2(Homo sapiens (Human))
St. Jude Children''S Research Hospital
US Patent
LigandPNGBDBM429675(US10550091, No. LC-84 | US10947203, No. LC-84)
Affinity DataIC50:  30nM. Assay description: The time-resolved fluorescence resonance transfer (TR-FRET) hPXR competitive binding assay was performed according to the manufacturer's instruct...
Ligand InfoPC cidPC sid
In DepthDetails US Patent
TargetNuclear receptor subfamily 1 group I member 2(Homo sapiens (Human))
St. Jude Children''S Research Hospital
US Patent
LigandPNGBDBM429675(US10550091, No. LC-84 | US10947203, No. LC-84)
Affinity DataEC50:  3.30E+3nM. Assay description: The hPXR transactivation assays (PXR agonistic and antagonistic assays) were performed in the HepG2 cells stably expressing FLAG-hPXR and CYP3A4-luci...
Ligand InfoPC cidPC sid
In DepthDetails US Patent