BDBM433491 US10562853, Compound 12
SMILES CSc1ccccc1OCCNCC1(F)CCN(CC1)C(=O)c1ccc(F)c(Cl)c1
InChI Key InChIKey=OLBJQOJHPPLFHK-UHFFFAOYSA-N
Data  3 KI
  Tab Delimited (TSV)   2D SDfile   Computed 3D by Vconf -m prep SDfile
Find this compound or compounds like it in BindingDB:
Activity Spreadsheet -- Enzyme Inhibition Constant Data from BindingDB
Found 3 hits for monomerid = 433491
Target5-hydroxytryptamine receptor 1A(Homo sapiens (Human))
Neurolixis
US Patent
LigandPNGBDBM433491(US10562853, Compound 12)
Affinity DataKi:  0.0290nM. Assay description: 5-HT1A: Radioligand binding was performed using membranes from CHO-K1 cells stably transfected with the human 5-HT1A receptor. All assays were carrie...
Ligand InfoPC cidPC sid
In DepthDetails US Patent
TargetAlpha-1A adrenergic receptor(Homo sapiens (Human))
Neurolixis
US Patent
LigandPNGBDBM433491(US10562853, Compound 12)
Affinity DataKi:  140nM. Assay description: Alpha1-adrenergic Receptor: Radioligand binding was performed using tissue (rat cortex). All assays were carried out in duplicates. 50 μL workin...
Ligand InfoPC cidPC sid
In DepthDetails US Patent
TargetD(2) dopamine receptor(Homo sapiens (Human))
Neurolixis
US Patent
LigandPNGBDBM433491(US10562853, Compound 12)
Affinity DataKi: >1.00E+3nM. Assay description: D2 Dopamine Receptor:Radioligand binding was performed using membranes from CHO-K1 cells stably transfected with the human D2 receptor. All assays we...
Ligand InfoPC cidPC sid
In DepthDetails US Patent