BDBM43680 MLS000110502::SMR000106431::cid_883228::phenyl-(4-pyrrolidin-1-ylphenyl)methanone::phenyl-(4-pyrrolidinophenyl)methanone::phenyl-[4-(1-pyrrolidinyl)phenyl]methanone
SMILES O=C(c1ccccc1)c1ccc(cc1)N1CCCC1
InChI Key InChIKey=BNWHLHLUIBNZIC-UHFFFAOYSA-N
Data  1 EC50
  Tab Delimited (TSV)   2D SDfile   Computed 3D by Vconf -m prep SDfile
Find this compound or compounds like it in BindingDB:
Activity Spreadsheet -- Enzyme Inhibition Constant Data from BindingDB
Found 1 hit for monomerid = 43680
TargetSignal transducer and activator of transcription 3 [702-738,740-752](Homo sapiens (Human))
The Scripps Research Institute Molecular Screening Center
Curated by PubChem BioAssay
LigandPNGBDBM43680(MLS000110502 | SMR000106431 | cid_883228 | phenyl-...)
Affinity DataEC50: >5.57E+4nM. Assay description: Source (MLPCN Center Name): The Scripps Research Institute Molecular Screening Center Center Affiliation: The Scripps Research Institute (TSRI) Assay...
In DepthDetails PCBioAssay