BDBM444598 US10662186, Compound 134::US10988476, Compound I-134
SMILES CC(C)n1c(C)nc2c(F)cc(cc12)-c1nc(Nc2ccc3CN(CCN(C)CC[Si](C)(C)C)CCc3n2)ncc1F
InChI Key InChIKey=SXVVQLGGDQUNKQ-UHFFFAOYSA-N
Data  9 IC50
  Tab Delimited (TSV)   2D SDfile   Computed 3D by Vconf -m prep SDfile
Find this compound or compounds like it in BindingDB:
Activity Spreadsheet -- Enzyme Inhibition Constant Data from BindingDB
Found 9 hits for monomerid = 444598
TargetCyclin-dependent kinase 4/G1/S-specific cyclin-D3(Homo sapiens (Human))
Shanghai Pharmaceuticals Holding
Curated by ChEMBL
LigandPNGBDBM444598(US10662186, Compound 134 | US10988476, Compound I-...)
Affinity DataIC50:  1.40nM. Assay description: Inhibition of recombinant human full length N-terminal GST-tagged CDK4 (1 to 303 residues)/cyclin D3 (1 to 292 residues) expressed in baculovirus exp...
Ligand InfoPC cidPC sid
In DepthDetails ArticlePubMed
TargetCyclin-dependent kinase 6/G1/S-specific cyclin-D3(Homo sapiens (Human))
Shanghai Pharmaceuticals Holding
Curated by ChEMBL
LigandPNGBDBM444598(US10662186, Compound 134 | US10988476, Compound I-...)
Affinity DataIC50:  1.60nM. Assay description: Inhibition of recombinant human full length N-terminal GST-tagged CDK6 (1 to 326 residues)/cyclin D3 (1 to 292 residues) expressed in baculovirus exp...
Ligand InfoPC cidPC sid
In DepthDetails ArticlePubMed
TargetCyclin-A2/Cyclin-dependent kinase 2(Homo sapiens (Human))
Shanghai Pharmaceuticals Holding
Curated by ChEMBL
LigandPNGBDBM444598(US10662186, Compound 134 | US10988476, Compound I-...)
Affinity DataIC50:  25nM. Assay description: Inhibition of recombinant human full length N-terminal GST-tagged CDK2 (1 to 298 residues)/cyclin A2 (1 to 432 residues) expressed in baculovirus exp...
Ligand InfoPC cidPC sid
In DepthDetails ArticlePubMed
TargetCyclin-dependent kinase 4(Homo sapiens (Human))
Shanghai Pharmaceuticals Holding
US Patent
LigandPNGBDBM444598(US10662186, Compound 134 | US10988476, Compound I-...)
Affinity DataIC50:  1.35nM. Assay description: 1. Take 10 mM stock solution of the test compound, in 96-well compound plate, DMSO was used to dilute the compound to an initial concentration of 100...
Ligand InfoPC cidPC sid
In DepthDetails US Patent
TargetCyclin-dependent kinase 2(Homo sapiens (Human))
Shanghai Pharmaceuticals Holding
US Patent
LigandPNGBDBM444598(US10662186, Compound 134 | US10988476, Compound I-...)
Affinity DataIC50:  25.1nM. Assay description: 1. Take 10 mM stock solution of the test compound, in 96-well compound plate, DMSO was used to dilute the compound to an initial concentration of 100...
Ligand InfoPC cidPC sid
In DepthDetails US Patent
TargetCyclin-dependent kinase 2(Homo sapiens (Human))
Shanghai Pharmaceuticals Holding
US Patent
LigandPNGBDBM444598(US10662186, Compound 134 | US10988476, Compound I-...)
Affinity DataIC50:  25.1nM. Assay description: 1. Take 10 mM stock solution of the test compound, in 96-well compound plate, DMSO was used to dilute the compound to an initial concentration of 100...
Ligand InfoPC cidPC sid
In DepthDetails US Patent
TargetCyclin-dependent kinase 4(Homo sapiens (Human))
Shanghai Pharmaceuticals Holding
US Patent
LigandPNGBDBM444598(US10662186, Compound 134 | US10988476, Compound I-...)
Affinity DataIC50:  1.35nM. Assay description: 1. Take 10 mM stock solution of the test compound, in 96-well compound plate, DMSO was used to dilute the compound to an initial concentration of 100...
Ligand InfoPC cidPC sid
In DepthDetails US Patent
TargetCyclin-dependent kinase 6(Homo sapiens (Human))
Shanghai Pharmaceuticals Holding
US Patent
LigandPNGBDBM444598(US10662186, Compound 134 | US10988476, Compound I-...)
Affinity DataIC50:  1.59nM. Assay description: 1. Take 10 mM stock solution of the test compound, in 96-well compound plate, DMSO was used to dilute the compound to an initial concentration of 100...
Ligand InfoPC cidPC sid
In DepthDetails US Patent
TargetCyclin-dependent kinase 6(Homo sapiens (Human))
Shanghai Pharmaceuticals Holding
US Patent
LigandPNGBDBM444598(US10662186, Compound 134 | US10988476, Compound I-...)
Affinity DataIC50:  1.59nM. Assay description: 1. Take 10 mM stock solution of the test compound, in 96-well compound plate, DMSO was used to dilute the compound to an initial concentration of 100...
Ligand InfoPC cidPC sid
In DepthDetails US Patent