BDBM445957 US10669246, Example 9::US10968188, Example 9
SMILES Cc1ccncc1-c1ccc2nc(NC(=O)[C@@H]3C[C@@H]3CO)sc2c1
InChI Key InChIKey=DOZOMJIBTQDXNA-CHWSQXEVSA-N
Data  5 IC50
  Tab Delimited (TSV)   2D SDfile   Computed 3D by Vconf -m prep SDfile
Find this compound or compounds like it in BindingDB:
Activity Spreadsheet -- Enzyme Inhibition Constant Data from BindingDB
Found 5 hits for monomerid = 445957
TargetTyrosine-protein kinase ABL1(Homo sapiens (Human))
1St Biotherapeutics
US Patent
LigandPNGBDBM445957(US10669246, Example 9 | US10968188, Example 9)
Affinity DataIC50:  34.6nM. Assay description: ADP-Glo assay kit was purchased from Promega. Magnesium chloride (MgCl2), bovine serum albumin (BSA), ethylene glycol-bis(β-aminoethyl ether)-N,...
Ligand InfoPC cidPC sid
In DepthDetails US Patent
TargetTyrosine-protein kinase ABL1(Homo sapiens (Human))
1St Biotherapeutics
US Patent
LigandPNGBDBM445957(US10669246, Example 9 | US10968188, Example 9)
Affinity DataIC50:  34.6nM. Assay description: ADP-Glo assay kit was purchased from Promega. Magnesium chloride (MgCl2), bovine serum albumin (BSA), ethylene glycol-bis(β-aminoethyl ether)-N,...
Ligand InfoPC cidPC sid
In DepthDetails US Patent
TargetTyrosine-protein kinase ABL1(Homo sapiens (Human))
1St Biotherapeutics
US Patent
LigandPNGBDBM445957(US10669246, Example 9 | US10968188, Example 9)
Affinity DataIC50:  32nM. Assay description: Inhibition of recombinant human His-tagged c-Abl kinase assessed as luminescence incubated for 30 mins by ADP-Glo assay
Ligand InfoPC cidPC sid
In DepthDetails ArticlePubMed
TargetTyrosine-protein kinase ABL1(Homo sapiens (Human))
1St Biotherapeutics
US Patent
LigandPNGBDBM445957(US10669246, Example 9 | US10968188, Example 9)
Affinity DataIC50:  34.6nM. Assay description: c-abl kinase activity was measured by Promega's ADP-Glo™ Assay. In this assay, His-tagged recombinant human ABL1 (0.25 ng/μl) is incubated w...
Ligand InfoPC cidPC sid
In DepthDetails US Patent
TargetTyrosine-protein kinase ABL1(Homo sapiens (Human))
1St Biotherapeutics
US Patent
LigandPNGBDBM445957(US10669246, Example 9 | US10968188, Example 9)
Affinity DataIC50:  34.6nM. Assay description: c-abl kinase activity was measured by Promega's ADP-Glo™ Assay. In this assay, His-tagged recombinant human ABL1 (0.25 ng/μl) is incubated w...
Ligand InfoPC cidPC sid
In DepthDetails US Patent