BDBM453290 US10730826, Compound 3a::US11325884, Compound 3a
SMILES NCCCCC(NC(=O)C1CCCC1)C(=O)COc1ccccc1F
InChI Key InChIKey=CJMLKFUQJAPXLR-UHFFFAOYSA-N
Data  10 IC50
  Tab Delimited (TSV)   2D SDfile   Computed 3D by Vconf -m prep SDfile
Find this compound or compounds like it in BindingDB:
Activity Spreadsheet -- Enzyme Inhibition Constant Data from BindingDB
Found 10 hits for monomerid = 453290
TargetLys-gingipain W83(Porphyromonas gingivalis)
Cortexyme
US Patent
LigandPNGBDBM453290(US10730826, Compound 3a | US11325884, Compound 3a)
Affinity DataIC50:  0.640nM. Assay description: The capacities of compounds of the present invention to inhibit the activity of lysine gingipain were measured in a fluorogenic assay similar to thos...
Ligand InfoPC cidPC sid
In DepthDetails US Patent
TargetCathepsin B(Homo sapiens (Human))
Cortexyme
US Patent
LigandPNGBDBM453290(US10730826, Compound 3a | US11325884, Compound 3a)
Affinity DataIC50:  5.22E+4nM. Assay description: The capacities of compounds of the present invention to inhibit the activity of lysine gingipain were measured in a fluorogenic assay similar to thos...
Ligand InfoPC cidPC sid
In DepthDetails US Patent
TargetCathepsin S(Homo sapiens (Human))
Cortexyme
US Patent
LigandPNGBDBM453290(US10730826, Compound 3a | US11325884, Compound 3a)
Affinity DataIC50: >1.00E+5nM. Assay description: The capacities of compounds of the present invention to inhibit the activity of lysine gingipain were measured in a fluorogenic assay similar to thos...
Ligand InfoPC cidPC sid
In DepthDetails US Patent
TargetCathepsin K(Homo sapiens (Human))
Cortexyme
US Patent
LigandPNGBDBM453290(US10730826, Compound 3a | US11325884, Compound 3a)
Affinity DataIC50: >1.00E+5nM. Assay description: The capacities of compounds of the present invention to inhibit the activity of lysine gingipain were measured in a fluorogenic assay similar to thos...
Ligand InfoPC cidPC sid
In DepthDetails US Patent
TargetProcathepsin L(Homo sapiens (Human))
Cortexyme
US Patent
LigandPNGBDBM453290(US10730826, Compound 3a | US11325884, Compound 3a)
Affinity DataIC50: >1.00E+5nM. Assay description: The capacities of compounds of the present invention to inhibit the activity of cathepsins B, H, K, L, and S were measured in similar assays. Boc-Leu...
Ligand InfoPC cidPC sid
In DepthDetails US Patent
TargetLys-gingipain(Porphyromonas gingivalis)
Cortexyme
US Patent
LigandPNGBDBM453290(US10730826, Compound 3a | US11325884, Compound 3a)
Affinity DataIC50:  0.640nM. Assay description: The capacities of compounds of the present invention to inhibit the activity of lysine gingipain (Kgp) were measured in a fluorogenic assay similar t...
Ligand InfoPC cidPC sid
In DepthDetails US Patent
TargetCathepsin B(Homo sapiens (Human))
Cortexyme
US Patent
LigandPNGBDBM453290(US10730826, Compound 3a | US11325884, Compound 3a)
Affinity DataIC50:  5.22E+4nM. Assay description: The capacities of compounds of the present invention to inhibit the activity of cathepsins B, H, K, L, and S were measured in similar assays. Boc-Leu...
Ligand InfoPC cidPC sid
In DepthDetails US Patent
TargetCathepsin S(Homo sapiens (Human))
Cortexyme
US Patent
LigandPNGBDBM453290(US10730826, Compound 3a | US11325884, Compound 3a)
Affinity DataIC50: >1.00E+5nM. Assay description: The capacities of compounds of the present invention to inhibit the activity of cathepsins B, H, K, L, and S were measured in similar assays. Boc-Leu...
Ligand InfoPC cidPC sid
In DepthDetails US Patent
TargetCathepsin K(Homo sapiens (Human))
Cortexyme
US Patent
LigandPNGBDBM453290(US10730826, Compound 3a | US11325884, Compound 3a)
Affinity DataIC50: >1.00E+5nM. Assay description: The capacities of compounds of the present invention to inhibit the activity of cathepsins B, H, K, L, and S were measured in similar assays. Boc-Leu...
Ligand InfoPC cidPC sid
In DepthDetails US Patent
TargetProcathepsin L(Homo sapiens (Human))
Cortexyme
US Patent
LigandPNGBDBM453290(US10730826, Compound 3a | US11325884, Compound 3a)
Affinity DataIC50: >1.00E+5nM. Assay description: The capacities of compounds of the present invention to inhibit the activity of lysine gingipain were measured in a fluorogenic assay similar to thos...
Ligand InfoPC cidPC sid
In DepthDetails US Patent