BDBM45795 4-methyl-N-(2-naphthalenyl)benzenesulfonamide::4-methyl-N-(2-naphthyl)benzenesulfonamide::4-methyl-N-naphthalen-2-yl-benzenesulfonamide::4-methyl-N-naphthalen-2-ylbenzenesulfonamide::CA inhibitor, 3::MLS-0090805.0001::cid_224144
SMILES Cc1ccc(cc1)S(=O)(=O)Nc1ccc2ccccc2c1
InChI Key InChIKey=HEXCXGXJELSYJW-UHFFFAOYSA-N
Data  2 KI  4 IC50
  Tab Delimited (TSV)   2D SDfile   Computed 3D by Vconf -m prep SDfile
Find this compound or compounds like it in BindingDB:
Activity Spreadsheet -- Enzyme Inhibition Constant Data from BindingDB
Found 6 hits for monomerid = 45795
TargetCarbonic anhydrase 1(Homo sapiens (Human))
Ataturk University
LigandPNGBDBM45795(4-methyl-N-(2-naphthalenyl)benzenesulfonamide | 4-...)
Affinity DataKi:  181nM ΔG°:  -9.19kcal/molepH: 7.5 T: 2°C. Assay description: An applied photophysics stopped flow instrument has been used for assaying the CA-catalyzed CO2 hydration activity [Khalifah et al., J. Biol. Chem., ...
In DepthDetails ArticlePubMed
TargetCarbonic anhydrase 2(Homo sapiens (Human))
Ataturk University
LigandPNGBDBM45795(4-methyl-N-(2-naphthalenyl)benzenesulfonamide | 4-...)
Affinity DataKi:  485nM ΔG°:  -8.61kcal/molepH: 7.5 T: 2°C. Assay description: An applied photophysics stopped flow instrument has been used for assaying the CA-catalyzed CO2 hydration activity [Khalifah et al., J. Biol. Chem., ...
In DepthDetails ArticlePubMed
TargetCarbonic anhydrase 6(Homo sapiens (Human))
Ataturk University
LigandPNGBDBM45795(4-methyl-N-(2-naphthalenyl)benzenesulfonamide | 4-...)
Affinity DataIC50:  4.24E+4nM. Assay description: Carbonic anhydrase activity was assayed by following the change in absorbance at 348 nm of 4-nitrophenylacetate (NPA) to 4-nitrophenylate ion over a ...
In DepthDetails ArticlePubMed
TargetCarbonic anhydrase 1(Homo sapiens (Human))
Ataturk University
LigandPNGBDBM45795(4-methyl-N-(2-naphthalenyl)benzenesulfonamide | 4-...)
Affinity DataIC50:  3.22E+5nM. Assay description: Carbonic anhydrase activity was assayed by following the change in absorbance at 348 nm of 4-nitrophenylacetate (NPA) to 4-nitrophenylate ion over a ...
In DepthDetails ArticlePubMed
TargetAlkaline phosphatase, tissue-nonspecific isozyme(Homo sapiens (Human))
Burnham Center For Chemical Genomics
Curated by PubChem BioAssay
LigandPNGBDBM45795(4-methyl-N-(2-naphthalenyl)benzenesulfonamide | 4-...)
Affinity DataIC50: >1.00E+5nM. Assay description: Sanford-Burnham Center for Chemical Genomics (SBCCG) Sanford-Burnham Medical Research Institute (SBMRI, San Diego, CA) NIH Molecular Libraries Screen...
In DepthDetails PCBioAssay
TargetCarbonic anhydrase 2(Homo sapiens (Human))
Ataturk University
LigandPNGBDBM45795(4-methyl-N-(2-naphthalenyl)benzenesulfonamide | 4-...)
Affinity DataIC50:  612nM. Assay description: Carbonic anhydrase activity was assayed by following the change in absorbance at 348 nm of 4-nitrophenylacetate (NPA) to 4-nitrophenylate ion over a ...
In DepthDetails ArticlePubMed