BDBM46345 MLS000094160::N-[(2-methyl-1,3-thiazol-4-yl)methyl]-4-phenoxy-benzenesulfonamide::N-[(2-methyl-1,3-thiazol-4-yl)methyl]-4-phenoxybenzenesulfonamide::N-[(2-methyl-4-thiazolyl)methyl]-4-phenoxybenzenesulfonamide::N-[(2-methylthiazol-4-yl)methyl]-4-phenoxy-benzenesulfonamide::SMR000016875::cid_3244729
SMILES Cc1nc(CNS(=O)(=O)c2ccc(Oc3ccccc3)cc2)cs1
InChI Key InChIKey=OXTHLNRFVHLMQI-UHFFFAOYSA-N
Data  2 IC50
  Tab Delimited (TSV)   2D SDfile   Computed 3D by Vconf -m prep SDfile
Find this compound or compounds like it in BindingDB:
Activity Spreadsheet -- Enzyme Inhibition Constant Data from BindingDB
Found 2 hits for monomerid = 46345
TargetSignal transducer and activator of transcription 1-alpha/beta(Homo sapiens (Human))
The Scripps Research Institute Molecular Screening Center
Curated by PubChem BioAssay
LigandPNGBDBM46345(MLS000094160 | N-[(2-methyl-1,3-thiazol-4-yl)methy...)
Affinity DataIC50: >5.57E+4nM. Assay description: Source (MLPCN Center Name): The Scripps Research Institute Molecular Screening Center Center Affiliation: The Scripps Research Institute (TSRI) Assay...
In DepthDetails PCBioAssay
TargetSignal transducer and activator of transcription 3 [702-738,740-752](Homo sapiens (Human))
The Scripps Research Institute Molecular Screening Center
Curated by PubChem BioAssay
LigandPNGBDBM46345(MLS000094160 | N-[(2-methyl-1,3-thiazol-4-yl)methy...)
Affinity DataIC50:  5.54E+3nM. Assay description: Source (MLPCN Center Name): The Scripps Research Institute Molecular Screening Center Center Affiliation: The Scripps Research Institute (TSRI) Assay...
In DepthDetails PCBioAssay