BDBM46522 2-[(Furan-2-ylmethyl)-amino]-succinic acid 1-(2-methoxy-ethyl) ester::3-(2-furanylmethylamino)-4-(2-methoxyethoxy)-4-oxobutanoic acid::3-(2-furfurylamino)-4-keto-4-(2-methoxyethoxy)butyric acid::3-(furan-2-ylmethylamino)-4-(2-methoxyethoxy)-4-oxidanylidene-butanoic acid::3-(furan-2-ylmethylamino)-4-(2-methoxyethoxy)-4-oxobutanoic acid::MLS000807054::SMR000414868::cid_3259549
SMILES COCCOC(=O)C(CC(O)=O)NCc1ccco1
InChI Key InChIKey=AYWWNXNKVVOLRI-UHFFFAOYSA-N
Data  4 EC50
  Tab Delimited (TSV)   2D SDfile   Computed 3D by Vconf -m prep SDfile
Find this compound or compounds like it in BindingDB:
Activity Spreadsheet -- Enzyme Inhibition Constant Data from BindingDB
Found 1 hit for monomerid = 46522
TargetEukaryotic translation initiation factor 2-alpha kinase 3(Homo sapiens (Human))
The Scripps Research Institute Molecular Screening Center
Curated by PubChem BioAssay
LigandPNGBDBM46522(2-[(Furan-2-ylmethyl)-amino]-succinic acid 1-(2-me...)
Affinity DataEC50: >5.57E+4nM. Assay description: Source (MLPCN Center Name): The Scripps Research Institute Molecular Screening Center (SRIMSC) Center Affiliation: The Scripps Research Institute (TS...
In DepthDetails PCBioAssay