BDBM468561 US10806794, Compound mPEG7-N-Darunavir
SMILES COCCOCCOCCOCCOCCOCCOCCNc1ccc(cc1)S(=O)(=O)N(CC(C)C)CC(O)[C@H](Cc1ccccc1)NC(=O)O[C@H]1CO[C@H]2OCC[C@@H]12
InChI Key InChIKey=AAJXKCGGRTZZCZ-YRYHPRDQSA-N
Data  1 IC50
  Tab Delimited (TSV)   2D SDfile   Computed 3D by Vconf -m prep SDfile
Find this compound or compounds like it in BindingDB:
Activity Spreadsheet -- Enzyme Inhibition Constant Data from BindingDB
Found 1 hit for monomerid = 468561
TargetHIV-1 protease(Human immunodeficiency virus)
Nektar Therapeutics
US Patent
LigandPNGBDBM468561(US10806794, Compound mPEG7-N-Darunavir)
Affinity DataIC50:  5.20nM. Assay description: Protease inhibitors (PI) are used to treat HIV infection by preventing viral assembly and maturation through the inhibition of HIV-1 protease activit...
Ligand InfoPC cidPC sid
In DepthDetails US Patent