BDBM468562 US10806794, Compound mPEG3-O-Darunavir
SMILES COCCOCCOCCOc1ccc(C[C@H](NC(=O)O[C@H]2CO[C@H]3OCC[C@@H]23)C(O)CN(CC(C)C)S(=O)(=O)c2ccc(N)cc2)cc1
InChI Key InChIKey=WDXXWDLDYBYRLP-LOKVAIBVSA-N
Data  1 IC50
  Tab Delimited (TSV)   2D SDfile   Computed 3D by Vconf -m prep SDfile
Find this compound or compounds like it in BindingDB:
Activity Spreadsheet -- Enzyme Inhibition Constant Data from BindingDB
Found 1 hit for monomerid = 468562
TargetHIV-1 protease(Human immunodeficiency virus)
Nektar Therapeutics
US Patent
LigandPNGBDBM468562(US10806794, Compound mPEG3-O-Darunavir)
Affinity DataIC50:  0.475nM. Assay description: Protease inhibitors (PI) are used to treat HIV infection by preventing viral assembly and maturation through the inhibition of HIV-1 protease activit...
Ligand InfoPC cidPC sid
In DepthDetails US Patent