BDBM468569 US10806794, Compound mPEG3-OCONH-Tipranavir
SMILES CC[C@@H](C1=C(O)C[C@@](CCCNC(=O)OCCOCCOCCOC)(CCc2ccccc2)OC1=O)c1cccc(NS(=O)(=O)c2ccc(cn2)C(F)(F)F)c1
InChI Key InChIKey=DWODTAADQXXNOA-FOEBFOTMSA-N
Data  1 IC50
  Tab Delimited (TSV)   2D SDfile   Computed 3D by Vconf -m prep SDfile
Find this compound or compounds like it in BindingDB:
Activity Spreadsheet -- Enzyme Inhibition Constant Data from BindingDB
Found 1 hit for monomerid = 468569
TargetHIV-1 protease(Human immunodeficiency virus)
Nektar Therapeutics
US Patent
LigandPNGBDBM468569(US10806794, Compound mPEG3-OCONH-Tipranavir)
Affinity DataIC50:  0.617nM. Assay description: Protease inhibitors (PI) are used to treat HIV infection by preventing viral assembly and maturation through the inhibition of HIV-1 protease activit...
Ligand InfoPC cidPC sid
In DepthDetails US Patent