BDBM47422 2-chloranyl-N-[4-(2,5-dimethylphenyl)sulfanylphenyl]ethanamide::2-chloro-N-[4-(2,5-dimethylphenyl)sulfanylphenyl]acetamide::2-chloro-N-[4-[(2,5-dimethylphenyl)thio]phenyl]acetamide::MLS000334726::SMR000249484::cid_2566138
SMILES Cc1ccc(C)c(Sc2ccc(NC(=O)CCl)cc2)c1
InChI Key InChIKey=KACFZWRSHRBOAC-UHFFFAOYSA-N
Data  2 IC50
  Tab Delimited (TSV)   2D SDfile   Computed 3D by Vconf -m prep SDfile
Find this compound or compounds like it in BindingDB:
Activity Spreadsheet -- Enzyme Inhibition Constant Data from BindingDB
Found 2 hits for monomerid = 47422
TargetProtein RecA(Mycobacterium tuberculosis H37Rv)
Southern Research Specialized Biocontainment Screening Center
Curated by PubChem BioAssay
LigandPNGBDBM47422(2-chloranyl-N-[4-(2,5-dimethylphenyl)sulfanylpheny...)
Affinity DataIC50:  2.25E+4nM. Assay description: Southern Research's Specialized Biocontainment Screening Center (SRSBSC) Southern Research Institute (Birmingham, Alabama) NIH Molecular Librarie...
In DepthDetails PCBioAssay
TargetTyrosine-protein kinase JAK2(Homo sapiens (Human))
The Scripps Research Institute Molecular Screening Center
Curated by PubChem BioAssay
LigandPNGBDBM47422(2-chloranyl-N-[4-(2,5-dimethylphenyl)sulfanylpheny...)
Affinity DataIC50:  7.26E+3nM. Assay description: Source (MLPCN Center Name): The Scripps Research Institute Molecular Screening Center (SRIMSC) Center Affiliation: The Scripps Research Institute (TS...
In DepthDetails PCBioAssay