BDBM476301 US10874683, Example 56.3
SMILES CCCCCCCOC(=O)ONc1ccn([C@@H]2O[C@H](CO)[C@H](O)C2O)c(=O)n1
InChI Key InChIKey=IKANHRUWKBEOQI-XENFMFCUSA-N
Data  1 EC50
  Tab Delimited (TSV)   2D SDfile   Computed 3D by Vconf -m prep SDfile
Find this compound or compounds like it in BindingDB:
Activity Spreadsheet -- Enzyme Inhibition Constant Data from BindingDB
Found 1 hit for monomerid = 476301
TargetReplicase polyprotein 1ab(Human SARS coronavirus (SARS-CoV) (Severe acute re...)
Emory University
US Patent
LigandPNGBDBM476301(US10874683, Example 56.3)
Affinity DataEC50:  700nM. Assay description: Several derivatives of EIDD-01931 have shown antiviral activity in screening against various viruses. Activity data is shown in the tables below. Nor...
Ligand InfoPC cidPC sid
In DepthDetails US Patent