BDBM479578 US10899735, No. 37
SMILES CCOc1nc(ccc1C1=NCCN1)-c1cccc(c1Cl)-c1cccc(c1Cl)-c1ccc(C2=NCCN2)c(OCC)n1
InChI Key InChIKey=CTAABOZZLQLDHD-UHFFFAOYSA-N
Data  1 IC50
  Tab Delimited (TSV)   2D SDfile   Computed 3D by Vconf -m prep SDfile
Find this compound or compounds like it in BindingDB:
Activity Spreadsheet -- Enzyme Inhibition Constant Data from BindingDB
Found 1 hit for monomerid = 479578
TargetProgrammed cell death 1 ligand 1/2(Homo sapiens (Human))
Gilead Sciences
US Patent
LigandPNGBDBM479578(US10899735, No. 37)
Affinity DataIC50:  64nM. Assay description: Compounds were tested in biochemical protein-protein interaction assays to determine if they can specifically block the interaction between the extra...
Ligand InfoPC cidPC sid
In DepthDetails US Patent