BDBM479609 US10899735, No. 68
SMILES COc1nc(ccc1CN1CC[C@@H](C1)C(O)=O)-c1cccc(c1Cl)-c1cccc(c1Cl)-c1ccc(CN2CC[C@@H](C2)C(O)=O)c(OC)n1
InChI Key InChIKey=OFHBDJBLETUPJQ-ZEQRLZLVSA-N
Data  1 IC50
  Tab Delimited (TSV)   2D SDfile   Computed 3D by Vconf -m prep SDfile
Find this compound or compounds like it in BindingDB:
Activity Spreadsheet -- Enzyme Inhibition Constant Data from BindingDB
Found 1 hit for monomerid = 479609
TargetProgrammed cell death 1 ligand 1/2(Homo sapiens (Human))
Gilead Sciences
US Patent
LigandPNGBDBM479609(US10899735, No. 68)
Affinity DataIC50:  108nM. Assay description: Compounds were tested in biochemical protein-protein interaction assays to determine if they can specifically block the interaction between the extra...
Ligand InfoPC cidPC sid
In DepthDetails US Patent