BDBM479788 US10899735, No. 247
SMILES COc1nc(ccc1CNC[C@@H]1CCC(=O)N1)-c1cccc(c1Cl)-c1cccc(c1Cl)-c1ccc(CN2CC3(C2)CNC(=O)C3)c(OC)n1
InChI Key InChIKey=FMIPGNMKNVLBDC-DEOSSOPVSA-N
Data  1 IC50
  Tab Delimited (TSV)   2D SDfile   Computed 3D by Vconf -m prep SDfile
Find this compound or compounds like it in BindingDB:
Activity Spreadsheet -- Enzyme Inhibition Constant Data from BindingDB
Found 1 hit for monomerid = 479788
TargetProgrammed cell death 1 ligand 1/2(Homo sapiens (Human))
Gilead Sciences
US Patent
LigandPNGBDBM479788(US10899735, No. 247)
Affinity DataIC50:  115nM. Assay description: Compounds were tested in biochemical protein-protein interaction assays to determine if they can specifically block the interaction between the extra...
Ligand InfoPC cidPC sid
In DepthDetails US Patent