BDBM480659 N-[6-morpholino-1-oxo-2-[rac- (2R)-2-fluoro-3-hydroxy-3- methyl-butyl]isoindolin-5-yl]- 2-(4-pyridyl)oxazole-4- carboxamide::US10899772, Example 9
SMILES CC(C)(O)[C@H](F)CN1Cc2cc(NC(=O)c3coc(n3)-c3ccncc3)c(cc2C1=O)N1CCOCC1
InChI Key InChIKey=FVDNPPQYTROFIN-JOCHJYFZSA-N
Data  1 KI
  Tab Delimited (TSV)   2D SDfile   Computed 3D by Vconf -m prep SDfile
Find this compound or compounds like it in BindingDB:
Activity Spreadsheet -- Enzyme Inhibition Constant Data from BindingDB
Found 1 hit for monomerid = 480659
TargetInterleukin-1 receptor-associated kinase 4(Homo sapiens (Human))
Genentech
US Patent
LigandPNGBDBM480659(N-[6-morpholino-1-oxo-2-[rac- (2R)-2-fluoro-3-hydr...)
Affinity DataKi:  0.680nM. Assay description: Kinase activities were assayed using the Transcreener-Fluorecescence polarization platform (BelBrook Labs, Madison, Wis., USA) that measures amounts ...
Ligand InfoPC cidPC sid
In DepthDetails US Patent