BDBM480668 N-[6-(dimethylamino)-1-oxo- 2-[rac-(2R)-2-fluoro-3-hydroxy- 3-methyl-butyl]isoindolin-5- yl]-6-(trifluoromethyl)pyridine- 2-carboxamide::US10899772, Example 18
SMILES CN(C)c1cc2C(=O)N(C[C@@H](F)C(C)(C)O)Cc2cc1NC(=O)c1cccc(n1)C(F)(F)F
InChI Key InChIKey=CDJXXQBQNHWVKS-QGZVFWFLSA-N
Data  1 KI
  Tab Delimited (TSV)   2D SDfile   Computed 3D by Vconf -m prep SDfile
Find this compound or compounds like it in BindingDB:
Activity Spreadsheet -- Enzyme Inhibition Constant Data from BindingDB
Found 1 hit for monomerid = 480668
TargetInterleukin-1 receptor-associated kinase 4(Homo sapiens (Human))
Genentech
US Patent
LigandPNGBDBM480668(N-[6-(dimethylamino)-1-oxo- 2-[rac-(2R)-2-fluoro-3...)
Affinity DataKi:  1.10nM. Assay description: Kinase activities were assayed using the Transcreener-Fluorecescence polarization platform (BelBrook Labs, Madison, Wis., USA) that measures amounts ...
Ligand InfoPC cidPC sid
In DepthDetails US Patent