BDBM480990 US10906888, Example 150
SMILES C[C@@H](Nc1ncc(cn1)C(=O)N1CCC2(C1)CCOCC2)c1cncnc1
InChI Key InChIKey=AKJYUFUVCGMGEN-CQSZACIVSA-N
Data  3 IC50
  Tab Delimited (TSV)   2D SDfile   Computed 3D by Vconf -m prep SDfile
Find this compound or compounds like it in BindingDB:
Activity Spreadsheet -- Enzyme Inhibition Constant Data from BindingDB
Found 3 hits for monomerid = 480990
TargetPantetheinase(Homo sapiens (Human))
Pfizer
US Patent
LigandPNGBDBM480990(US10906888, Example 150)
Affinity DataIC50:  27.8nM. Assay description: The test inhibitors were solubilized in DMSO to a stock concentration of 30 mM. On the day of the assay, dose response plates were prepared by diluti...
Ligand InfoPC cidPC sid
In DepthDetails US Patent
TargetBiotinidase(Homo sapiens)
Pfizer
Curated by ChEMBL
LigandPNGBDBM480990(US10906888, Example 150)
Affinity DataIC50: >5.00E+4nM. Assay description: Inhibition of N-terminal FLAG/His6-tagged human biotinidase expressed in COS cells using biotinyl-7-amino-4-trifluoromethylcoumarin as substrate prei...
Ligand InfoPC cidPC sid
In DepthDetails ArticlePubMed
TargetPantetheinase(Homo sapiens (Human))
Pfizer
US Patent
LigandPNGBDBM480990(US10906888, Example 150)
Affinity DataIC50:  28nM. Assay description: Inhibition of recombinant N-terminal FLAG/His6-tagged human vanin-1 expressed in CHO cells using Pantetheine-7-amino-4-trifluoromethykournarin as sub...
Ligand InfoPC cidPC sid
In DepthDetails ArticlePubMed