BDBM481877 US10913744, Compound 16
SMILES CNc1nc(Nc2cc(F)c(cc2OC)C(=O)N2CCOCC2)nc2[nH]ccc12
InChI Key InChIKey=LCVQMORYQXJPGQ-UHFFFAOYSA-N
Data  2 IC50
  Tab Delimited (TSV)   2D SDfile   Computed 3D by Vconf -m prep SDfile
Find this compound or compounds like it in BindingDB:
Activity Spreadsheet -- Enzyme Inhibition Constant Data from BindingDB
Found 2 hits for monomerid = 481877
TargetLeucine-rich repeat serine/threonine-protein kinase 2 [1326-2527,G2019S](Homo sapiens (Human))
Dana-Farber Cancer Institute
US Patent
LigandPNGBDBM481877(US10913744, Compound 16)
Affinity DataIC50:  7.10nM. Assay description: Active GST-LRRK2 (1326-2527), GST-LRRK2[G2019S] (1326-2527), GST-LRRK2[A2016T] (1326-2527) and GST-LRRK2[A2016T+G2019S] (1326-2527) enzyme was purifi...
Ligand InfoPC cidPC sid
In DepthDetails US Patent
TargetLeucine-rich repeat serine/threonine-protein kinase 2 [1326-2527](Homo sapiens (Human))
Dana-Farber Cancer Institute
US Patent
LigandPNGBDBM481877(US10913744, Compound 16)
Affinity DataIC50:  2.10nM. Assay description: Active GST-LRRK2 (1326-2527), GST-LRRK2[G2019S] (1326-2527), GST-LRRK2[A2016T] (1326-2527) and GST-LRRK2[A2016T+G2019S] (1326-2527) enzyme was purifi...
Ligand InfoPC cidPC sid
In DepthDetails US Patent