BDBM486401 US10947222, Example 32::methyl 3-{6-[(1,1- dioxidotetrahydrothiophen-3- yl)carbamoyl]-1-(4-fluorophenyl)- 1H-indol-3-yl}benzoate (racemic)
SMILES COC(=O)c1cccc(c1)-c1cn(-c2ccc(F)cc2)c2cc(ccc12)C(=O)NC1CCS(=O)(=O)C1
InChI Key InChIKey=OFIYHPAOTJVMMG-UHFFFAOYSA-N
Data  1 IC50
  Tab Delimited (TSV)   2D SDfile   Computed 3D by Vconf -m prep SDfile
Find this compound or compounds like it in BindingDB:
Activity Spreadsheet -- Enzyme Inhibition Constant Data from BindingDB
Found 1 hit for monomerid = 486401
TargetDiacylglycerol O-acyltransferase 2(Homo sapiens (Human))
Merck Sharp & Dohme
US Patent
LigandPNGBDBM486401(US10947222, Example 32 | methyl 3-{6-[(1,1- dioxid...)
Affinity DataIC50:  3.20nM. Assay description: DGAT2 activity was determined by measuring the amount of enzymatic product triolein (1,2,3-Tri(cis-9-octadecenoyl)glycerol) using the membrane prep m...
Ligand InfoPC cidPC sid
In DepthDetails US Patent