BDBM486681 US10947252, Example 121::US11427601, Example 121
SMILES C[C@@H](CCO)Nc1ccc2c(OC3(CCOCC3)CN(Cc3cc(ccc3C)[C@@H](c3ccn4c(nnc4c3C)C(F)(F)F)C(C)(C)C(O)=O)S2(=O)=O)n1
InChI Key InChIKey=JCEWKODHUJOFSX-ZTOMLWHTSA-N
Data  2 Kd
  Tab Delimited (TSV)   2D SDfile   Computed 3D by Vconf -m prep SDfile
Find this compound or compounds like it in BindingDB:
Activity Spreadsheet -- Enzyme Inhibition Constant Data from BindingDB
Found 2 hits for monomerid = 486681
TargetKelch-like ECH-associated protein 1 [321-624](Homo sapiens (Human))
Janssen Pharmaceutica
US Patent
LigandPNGBDBM486681(US10947252, Example 121 | US11427601, Example 121)
Affinity DataKd: <1nM. Assay description: The details of the KEAP1 KELCH ThermoFluorŪ Assay Construct are as follows: Kelch domain of human KEAP 1 (321-624 aa) was used in the assay. The prot...
Ligand InfoPC cidPC sid
TargetKelch-like ECH-associated protein 1/Nuclear factor erythroid 2-related factor 2(Homo sapiens (Human))
Janssen Pharmaceutica
US Patent
LigandPNGBDBM486681(US10947252, Example 121 | US11427601, Example 121)
Affinity DataKd: <1nM. Assay description: The ThermoFluorŪ is a fluorescence based assay (Tf) that estimates ligand binding affinities by measuring the effect of a ligand on protein thermal s...
Ligand InfoPC cidPC sid
In DepthDetails US Patent