BDBM48707 MLS000575114::N-[2-methyl-4-(phenylsulfanylmethyl)phenyl]-3-nitro-benzamide::N-[2-methyl-4-(phenylsulfanylmethyl)phenyl]-3-nitrobenzamide::N-[2-methyl-4-[(phenylthio)methyl]phenyl]-3-nitro-benzamide::N-[2-methyl-4-[(phenylthio)methyl]phenyl]-3-nitrobenzamide::N-{2-methyl-4-[(phenylthio)methyl]phenyl}-3-nitrobenzamide::SMR000196348::cid_1320559
SMILES Cc1cc(CSc2ccccc2)ccc1NC(=O)c1cccc(c1)[N+]([O-])=O
InChI Key InChIKey=CCTDFOABYYEBJZ-UHFFFAOYSA-N
Data  1 IC50
  Tab Delimited (TSV)   2D SDfile   Computed 3D by Vconf -m prep SDfile
Find this compound or compounds like it in BindingDB:
Activity Spreadsheet -- Enzyme Inhibition Constant Data from BindingDB
Found 1 hit for monomerid = 48707
TargetEukaryotic translation initiation factor 4 gamma 1(Homo sapiens (Human))
Emory University
Curated by PubChem BioAssay
LigandPNGBDBM48707(MLS000575114 | N-[2-methyl-4-(phenylsulfanylmethyl...)
Affinity DataIC50:  6.40E+4nM. Assay description: Dose Response Confirmation for Small Molecule Inhibitors of Eukaryotic Translation Initiation NIH Molecular Libraries Screening Centers Network [MLSC...
In DepthDetails PCBioAssay