BDBM489717 US10968163, Compound 3l-C
SMILES OC(=O)[C@H]1[C@H]([C@@H]([C@@H]1c1ccccc1)C(=O)O[C@@H]1CCCC[C@H]1c1ccccc1)c1ccccc1
InChI Key InChIKey=UWVLNPDXTVRILC-BAJYJESISA-N
Data  1 KI
  Tab Delimited (TSV)   2D SDfile   Computed 3D by Vconf -m prep SDfile
Find this compound or compounds like it in BindingDB:
Activity Spreadsheet -- Enzyme Inhibition Constant Data from BindingDB
Found 1 hit for monomerid = 489717
TargetFatty acid-binding protein 5(Homo sapiens (Human))
The Research Foundation For The State University Of New York
US Patent
LigandPNGBDBM489717(US10968163, Compound 3l-C)
Affinity DataKi:  20nM. Assay description: FABP5 was purified and delipidated as described previously (Kaczocha, M. et al. 2012). FABP5 (30 μg), NBD-stearate (1 μM), and a competitor...
Ligand InfoPC cidPC sid
In DepthDetails US Patent