BDBM493978 N-[6-[4-fluoro-4-(hydroxymethyl)-1- piperidyl]-2,2-dimethyl-3H- benzofuran-5-yl]pyrazolo[1,5- a]pyrimidine-3-carboxamide::US10988478, Example 40
SMILES CC1(C)Cc2cc(NC(=O)c3cnn4cccnc34)c(cc2O1)N1CCC(F)(CO)CC1
InChI Key InChIKey=SQXWBGDUBWXJAT-UHFFFAOYSA-N
Data  1 KI
  Tab Delimited (TSV)   2D SDfile   Computed 3D by Vconf -m prep SDfile
Find this compound or compounds like it in BindingDB:
Activity Spreadsheet -- Enzyme Inhibition Constant Data from BindingDB
Found 1 hit for monomerid = 493978
TargetInterleukin-1 receptor-associated kinase 4(Homo sapiens (Human))
Genentech
US Patent
LigandPNGBDBM493978(N-[6-[4-fluoro-4-(hydroxymethyl)-1- piperidyl]-2,2...)
Affinity DataKi:  1nM. Assay description: Kinase activities were assayed using the Transcreener-Fluorecescence polarization platform (BelBrook Labs, Madison, Wis., USA) that measures amounts ...
Ligand InfoPC cidPC sid
In DepthDetails US Patent