BDBM496900 science.abl4784, 4
SMILES CC(C)[C@H](NS(C)(=O)=O)C(=O)N1C[C@@H]2[C@H]([C@@H]1C(=O)N[C@H](C[C@H]1CCNC1=O)C(=O)c1nc3ccccc3s1)C2(C)C
InChI Key InChIKey=ULSNGHDTLFJHAM-ULVDTXHQSA-N
Data  1 KI  1 EC50
  Tab Delimited (TSV)   2D SDfile   Computed 3D by Vconf -m prep SDfile
Find this compound or compounds like it in BindingDB:
Activity Spreadsheet -- Enzyme Inhibition Constant Data from BindingDB
Found 2 hits for monomerid = 496900
TargetReplicase polyprotein 1ab(2019-nCoV)
Pfizer
LigandPNGBDBM496900(science.abl4784, 4)
Affinity DataKi:  7.93nM. Assay description: The respective human coronavirus Mpro in assay buffer (20 mM Tris-HCl, pH 7.3, 100 mM NaCl, 1 mM EDTA, 5 mM TCEP) and 0.1% BSA was added to assay-rea...
Ligand InfoPC cidPC sid
In DepthDetails
TargetAngiotensin-converting enzyme 2(Homo sapiens (Human))
Pfizer
LigandPNGBDBM496900(science.abl4784, 4)
Affinity DataEC50:  909nM. Assay description: VeroE6 cells were sorted for ACE2 expression by flow cytometry to generate clonal VeroE6 cells that are enriched for ACE2 surface expression. The ACE...
Ligand InfoPC cidPC sid
In DepthDetails