BDBM49855 2-[(3-cyano-6-methyl-2-quinolinyl)thio]acetic acid methyl ester::2-[(3-cyano-6-methyl-2-quinolyl)thio]acetic acid methyl ester::MLS000856026::SMR000286471::cid_855796::methyl 2-(3-cyano-6-methyl-quinolin-2-yl)sulfanylethanoate::methyl 2-(3-cyano-6-methylquinolin-2-yl)sulfanylacetate
SMILES COC(=O)CSc1nc2ccc(C)cc2cc1C#N
InChI Key InChIKey=VUWDPTAVFZNRQN-UHFFFAOYSA-N
Data  3 EC50
  Tab Delimited (TSV)   2D SDfile   Computed 3D by Vconf -m prep SDfile
Find this compound or compounds like it in BindingDB:
Activity Spreadsheet -- Enzyme Inhibition Constant Data from BindingDB
Found 3 hits for monomerid = 49855
TargetTranscription factor p65(Homo sapiens (Human))
Srmlsc
Curated by PubChem BioAssay
LigandPNGBDBM49855(2-[(3-cyano-6-methyl-2-quinolinyl)thio]acetic acid...)
Affinity DataEC50:  3.41E+6nM. Assay description: Southern Research Molecular Libraries Screening Center (SRMLSC) Southern Research Institute (Birmingham, Alabama) NIH Molecular Libraries Screening C...
In DepthDetails PCBioAssay
TargetEndoribonuclease toxin MazF(Escherichia coli str. K-12 substr. MG1655)
Burnham Center For Chemical Genomics
Curated by PubChem BioAssay
LigandPNGBDBM49855(2-[(3-cyano-6-methyl-2-quinolinyl)thio]acetic acid...)
Affinity DataEC50: >9.90E+4nM. Assay description: Data Source: Sanford-Burnham Center for Chemical Genomics (SBCCG) Source Affiliation: Sanford-Burnham Medical Research Institute (SBMRI, San Diego, C...
In DepthDetails PCBioAssay
TargetEndoribonuclease toxin MazF(Escherichia coli str. K-12 substr. MG1655)
Burnham Center For Chemical Genomics
Curated by PubChem BioAssay
LigandPNGBDBM49855(2-[(3-cyano-6-methyl-2-quinolinyl)thio]acetic acid...)
Affinity DataEC50: >9.90E+4nM. Assay description: Data Source: Sanford-Burnham Center for Chemical Genomics (SBCCG) Source Affiliation: Sanford-Burnham Medical Research Institute (SBMRI, San Diego, C...
In DepthDetails PCBioAssay