BDBM50000867 7-(4-Hydroxy-pentyloxy)-1,3-dihydro-imidazo[4,5-b]quinolin-2-one::CHEMBL91359
SMILES CC(O)CCCOc1ccc2nc3[nH]c(=O)[nH]c3cc2c1
InChI Key InChIKey=AOAQFGRPXBJZPI-UHFFFAOYSA-N
Data  1 IC50  2 EC50
  Tab Delimited (TSV)   2D SDfile   Computed 3D by Vconf -m prep SDfile
Find this compound or compounds like it in BindingDB:
Activity Spreadsheet -- Enzyme Inhibition Constant Data from BindingDB
Found 2 hits for monomerid = 50000867
Target3',5'-cyclic-AMP phosphodiesterase(Sus scrofa)
Bristol-Myers Squibb Pharmaceutical Research Institute
Curated by ChEMBL
LigandPNGBDBM50000867(7-(4-Hydroxy-pentyloxy)-1,3-dihydro-imidazo[4,5-b]...)
Affinity DataEC50:  520nM. Assay description: Inhibition of ADP-induced platelet aggregation in rabbit platelet rich plasma (PRP)
In DepthDetails ArticlePubMed
TargetP2Y purinoceptor 12(Homo sapiens (Human))
Bristol-Myers Squibb Pharmaceutical Research Institute
Curated by ChEMBL
LigandPNGBDBM50000867(7-(4-Hydroxy-pentyloxy)-1,3-dihydro-imidazo[4,5-b]...)
Affinity DataEC50:  100nM. Assay description: Inhibition of platelet aggregation using adenosine diphosphate (ADP) as activating agent in human platelet rich plasma (PRP)
In DepthDetails ArticlePubMed