BDBM50002719 CHEMBL412179
SMILES CC(C)[C@H](NC(=O)[C@@H]1CSSC[C@H](NC(=O)[C@@H](N)CC(O)=O)C(=O)N[C@@H](Cc2ccccc2)C(=O)N[C@@H](Cc2c[nH]c3ccccc23)C(=O)N[C@@H](CCCCN)C(=O)N[C@@H](Cc2ccc(N)cc2)C(=O)N1)C(O)=O
InChI Key InChIKey=MWIYTUFCPUEVBP-LOWSNRHLSA-N
Data  1 KI
  Tab Delimited (TSV)   2D SDfile   Computed 3D by Vconf -m prep SDfile
Find this compound or compounds like it in BindingDB:
Activity Spreadsheet -- Enzyme Inhibition Constant Data from BindingDB
Found 1 hit for monomerid = 50002719
TargetUrotensin-2 receptor(Homo sapiens (Human))
University Of Rouen
Curated by ChEMBL
LigandPNGBDBM50002719(CHEMBL412179)
Affinity DataKi:  10nM. Assay description: Displacement of [125I]human urotensin-2 from human GPR14 transfected in CHO cellsChecked by Author
In DepthDetails ArticlePubMed