BDBM50002801 11-[2-(5,7-Dimethoxy-benzoimidazol-1-yl)-ethylidene]-6,11-dihydro-dibenzo[b,e]oxepine-2-carboxylic acid::CHEMBL113944
SMILES COc1cc(OC)c2n(C\C=C3/c4ccccc4COc4ccc(cc34)C(O)=O)cnc2c1
InChI Key InChIKey=ZIHLNOJDHHVVRG-AWQFTUOYSA-N
Data  1 KI
  Tab Delimited (TSV)   2D SDfile   Computed 3D by Vconf -m prep SDfile
Find this compound or compounds like it in BindingDB:
Activity Spreadsheet -- Enzyme Inhibition Constant Data from BindingDB
Found 1 hit for monomerid = 50002801
TargetThromboxane A2 receptor(Homo sapiens (Human))
Kyowa Hakko Kogyo
Curated by ChEMBL
LigandPNGBDBM50002801(11-[2-(5,7-Dimethoxy-benzoimidazol-1-yl)-ethyliden...)
Affinity DataKi:  6.10nM. Assay description: Binding affinity at TXA2/PGH2 receptor by measuring its ability to displace [3H]-U-46,619 from guinea pig platelets
In DepthDetails ArticlePubMed