BDBM50003694 CHEMBL3234947
SMILES Nc1nc(SCc2coc(n2)-c2ccc(F)cc2)nc(-c2ccc3OCOc3c2)c1C#N
InChI Key InChIKey=QUOSSFQIJVMBQO-UHFFFAOYSA-N
Data  1 KI
  Tab Delimited (TSV)   2D SDfile   Computed 3D by Vconf -m prep SDfile
Find this compound or compounds like it in BindingDB:
Activity Spreadsheet -- Enzyme Inhibition Constant Data from BindingDB
Found 1 hit for monomerid = 50003694
TargetAdenosine receptor A1(Homo sapiens (Human))
Leiden University
Curated by ChEMBL
LigandPNGBDBM50003694(CHEMBL3234947)
Affinity DataKi:  20nM. Assay description: Displacement of [3H]DPCPX from human adenosine A1 receptor expressed in CHO cell membranes after 1 hr by beta scintillation counting analysis
In DepthDetails ArticlePubMed