BDBM50003952 CHEMBL3236093
SMILES COc1ccc(\C=C\C(=O)Nc2cc(OC)c(OC)c(OC)c2)cc1O
InChI Key InChIKey=VBWWEYPTKVJYKJ-SOFGYWHQSA-N
Data  2 IC50
  Tab Delimited (TSV)   2D SDfile   Computed 3D by Vconf -m prep SDfile
Find this compound or compounds like it in BindingDB:
Activity Spreadsheet -- Enzyme Inhibition Constant Data from BindingDB
Found 2 hits for monomerid = 50003952
TargetAcetylcholinesterase(Electrophorus electricus (Electric eel))
Quaid-I-Azam University
Curated by ChEMBL
LigandPNGBDBM50003952(CHEMBL3236093)
Affinity DataIC50:  4.22E+3nM. Assay description: Inhibition of electric eel acetylcholinesterase using acetylthiocholine iodide as substrate preincubated for 10 mins before substrate addition after ...
In DepthDetails ArticlePubMed
TargetCholinesterase(Homo sapiens (Human))
Quaid-I-Azam University
Curated by ChEMBL
LigandPNGBDBM50003952(CHEMBL3236093)
Affinity DataIC50:  7.65E+3nM. Assay description: Inhibition of human BChE using butyrylthiocholine iodide as substrate preincubated for 10 mins before substrate addition after 15 mins by Ellman's me...
In DepthDetails ArticlePubMed