BDBM50003955 CHEMBL3235784
SMILES COc1cc(\C=C\C(=O)Nc2cc(OC)c(OC)c(OC)c2)ccc1OCc1ccccc1
InChI Key InChIKey=SSFWKPVULLKYOH-ACCUITESSA-N
Data  1 IC50
  Tab Delimited (TSV)   2D SDfile   Computed 3D by Vconf -m prep SDfile
Find this compound or compounds like it in BindingDB:
Activity Spreadsheet -- Enzyme Inhibition Constant Data from BindingDB
Found 1 hit for monomerid = 50003955
TargetAcetylcholinesterase(Electrophorus electricus (Electric eel))
Quaid-I-Azam University
Curated by ChEMBL
LigandPNGBDBM50003955(CHEMBL3235784)
Affinity DataIC50:  1.26E+4nM. Assay description: Inhibition of electric eel acetylcholinesterase using acetylthiocholine iodide as substrate preincubated for 10 mins before substrate addition after ...
In DepthDetails ArticlePubMed