BDBM50003962 CHEMBL3236091
SMILES COc1cc(NC(=O)\C=C\c2ccc(Cl)cc2)cc(OC)c1OC
InChI Key InChIKey=JXXHUJFYBJUFSP-RMKNXTFCSA-N
Data  1 IC50
  Tab Delimited (TSV)   2D SDfile   Computed 3D by Vconf -m prep SDfile
Find this compound or compounds like it in BindingDB:
Activity Spreadsheet -- Enzyme Inhibition Constant Data from BindingDB
Found 1 hit for monomerid = 50003962
TargetAcetylcholinesterase(Electrophorus electricus (Electric eel))
Quaid-I-Azam University
Curated by ChEMBL
LigandPNGBDBM50003962(CHEMBL3236091)
Affinity DataIC50:  3.12E+4nM. Assay description: Inhibition of electric eel acetylcholinesterase using acetylthiocholine iodide as substrate preincubated for 10 mins before substrate addition after ...
In DepthDetails ArticlePubMed