BDBM50004522 CHEMBL3233665
SMILES Cl.CN1C(=O)N(CCCCCN2CCN(CC2)c2ccccc2)C(C)(C1=O)c1ccccc1
InChI Key InChIKey=GELFDQDYMKEZRK-UHFFFAOYSA-N
Data  2 KI
  Tab Delimited (TSV)   2D SDfile   Computed 3D by Vconf -m prep SDfile
Find this compound or compounds like it in BindingDB:
Activity Spreadsheet -- Enzyme Inhibition Constant Data from BindingDB
Found 2 hits for monomerid = 50004522
Target5-hydroxytryptamine receptor 1A(Homo sapiens (Human))
Jagiellonian University Medical College
Curated by ChEMBL
LigandPNGBDBM50004522(CHEMBL3233665)
Affinity DataKi:  135nM. Assay description: Displacement of [3H]-8-OH-DPAT from human recombinant 5-HT1A receptor expressed in HEK293 cell membrane after 1 hr by Microbeta scintillation countin...
In DepthDetails ArticlePubMed
Target5-hydroxytryptamine receptor 6(Homo sapiens (Human))
Jagiellonian University Medical College
Curated by ChEMBL
LigandPNGBDBM50004522(CHEMBL3233665)
Affinity DataKi:  9.60E+3nM. Assay description: Displacement of [3H]-LSD from human recombinant 5-HT6 receptor expressed in HEK293 cell membrane after 1 hr by Microbeta scintillation counting analy...
In DepthDetails ArticlePubMed