BDBM50010514 CHEMBL3264375
SMILES O=C(NCCN1CCN(CC1)c1ccccc1)c1ccc2ccccc2c1
InChI Key InChIKey=VQPKBEPTXUAIJW-UHFFFAOYSA-N
Data  1 KI
  Tab Delimited (TSV)   2D SDfile   Computed 3D by Vconf -m prep SDfile
Find this compound or compounds like it in BindingDB:
Activity Spreadsheet -- Enzyme Inhibition Constant Data from BindingDB
Found 1 hit for monomerid = 50010514
Target5-hydroxytryptamine receptor 1A(Homo sapiens (Human))
University Of Li£Ge
Curated by ChEMBL
LigandPNGBDBM50010514(CHEMBL3264375)
Affinity DataKi:  25nM. Assay description: Displacement of [3H]-8-OH-OPAT from human recombinant 5HT1A receptor expressed in CHO cells after 60 mins by liquid scintillation counting analysis
In DepthDetails ArticlePubMed