BDBM50010527 CHEMBL3264390
SMILES Clc1ccc(cc1)C1=CCN(CCN2C(=O)c3ccccc3C2=O)CC1
InChI Key InChIKey=WIRXLVFKWXZQIL-UHFFFAOYSA-N
Data  1 KI
  Tab Delimited (TSV)   2D SDfile   Computed 3D by Vconf -m prep SDfile
Find this compound or compounds like it in BindingDB:
Activity Spreadsheet -- Enzyme Inhibition Constant Data from BindingDB
Found 1 hit for monomerid = 50010527
Target5-hydroxytryptamine receptor 1A(Homo sapiens (Human))
University Of Li£Ge
Curated by ChEMBL
LigandPNGBDBM50010527(CHEMBL3264390)
Affinity DataKi:  631nM. Assay description: Displacement of [3H]-8-OH-OPAT from human recombinant 5HT1A receptor expressed in CHO cells after 60 mins by liquid scintillation counting analysis
In DepthDetails ArticlePubMed