BDBM50012134 CHEMBL3263700
SMILES CC(C)CN(Cc1ccc(s1)-c1ccc(cc1)C(N)=O)S(=O)(=O)Cc1ccccc1
InChI Key InChIKey=OJUQCIBEPUVZDG-UHFFFAOYSA-N
Data  1 IC50  1 EC50
  Tab Delimited (TSV)   2D SDfile   Computed 3D by Vconf -m prep SDfile
Find this compound or compounds like it in BindingDB:
Activity Spreadsheet -- Enzyme Inhibition Constant Data from BindingDB
Found 2 hits for monomerid = 50012134
TargetNuclear receptor ROR-gamma(Homo sapiens (Human))
Genentech
Curated by ChEMBL
LigandPNGBDBM50012134(CHEMBL3263700)
Affinity DataIC50:  160nM. Assay description: Displacement of [3H2]25-hydroxycholesterol from human RORc-LBD after 3 hrs by scintillation counting
In DepthDetails ArticlePubMed
TargetNuclear receptor ROR-gamma(Homo sapiens (Human))
Genentech
Curated by ChEMBL
LigandPNGBDBM50012134(CHEMBL3263700)
Affinity DataEC50:  130nM. Assay description: Inverse agonist activity at an N-terminal 6xHis-GST-tag human RORc-LBD assessed as inhibition of recruitment of the SRC1 co-activator peptide after 3...
In DepthDetails ArticlePubMed