BDBM50012968 4-Azido-N-(1-benzyl-piperidin-4-yl)-5-iodo-2-methoxy-benzamide::4-Azido-N-(1-benzyl-piperidin-4-yl)-5-iodo-2-methoxy-benzamide (iodoazidoclebopride)::CHEMBL50154
SMILES COc1cc(N=[N+]=[N-])c(I)cc1C(=O)NC1CCN(Cc2ccccc2)CC1
InChI Key InChIKey=UFNGQEVXMTYIHB-UHFFFAOYSA-N
Data  1 Kd
  Tab Delimited (TSV)   2D SDfile   Computed 3D by Vconf -m prep SDfile
Find this compound or compounds like it in BindingDB:
Activity Spreadsheet -- Enzyme Inhibition Constant Data from BindingDB
Found 1 hit for monomerid = 50012968
TargetD(2) dopamine receptor(Rattus norvegicus (rat))
University Of Pennsylvania
Curated by ChEMBL
LigandPNGBDBM50012968(4-Azido-N-(1-benzyl-piperidin-4-yl)-5-iodo-2-metho...)
Affinity DataKd:  14nM. Assay description: Evaluated in vivo for the affinity towards Dopamine receptor D2 of rat striatal tissue
In DepthDetails ArticlePubMed