BDBM50013040 CHEMBL93244::N-[4-(1H-Indol-3-yl)-thiazol-2-ylmethyl]-N-methyl-guanidine
SMILES CN(Cc1nc(cs1)-c1c[nH]c2ccccc12)C(N)=N
InChI Key InChIKey=QDPQXKBLRGKFJX-UHFFFAOYSA-N
Data  1 KI
  Tab Delimited (TSV)   2D SDfile   Computed 3D by Vconf -m prep SDfile
Find this compound or compounds like it in BindingDB:
Activity Spreadsheet -- Enzyme Inhibition Constant Data from BindingDB
Found 1 hit for monomerid = 50013040
Target5-hydroxytryptamine receptor 3B(Mus musculus)
Pfizer
Curated by ChEMBL
LigandPNGBDBM50013040(CHEMBL93244 | N-[4-(1H-Indol-3-yl)-thiazol-2-ylmet...)
Affinity DataKi: >1nM. Assay description: In vitro binding affinity for the 5-hydroxytryptamine 3 receptor was determined with NG-108-15 mouse neuroblastoma-glioma cells
In DepthDetails ArticlePubMed